*Heading
** Job name: Job-11 Model name: Model-2bridge-tied
** Generated by: Abaqus/CAE 6.9-1
*Preprint, echo=NO, model=NO, history=NO, contact=NO
**
** PARTS
**
*Part, name=Part-1
*Node
*Element, type=C3D8R
*Nset, nset=_PickedSet23, internal, generate
*Elset, elset=_PickedSet23, internal, generate
** Section: Section-1
*Solid Section, elset=_PickedSet23, material=Material-1
*End Part
**
*Part, name=Part-2
*Node
*Element, type=C3D8R
*Nset, nset=_PickedSet4, internal, generate
*Elset, elset=_PickedSet4, internal, generate
** Section: Section-2
*Solid Section, elset=_PickedSet4, material=Concrete
*End Part
**
**
** ASSEMBLY
**
*Assembly, name=Assembly
**
*Instance, name=Part-1-1, part=Part-1
*End Instance
**
*Instance, name=Part-2-1, part=Part-2
*End Instance
**
*Instance, name=Part-2-1-lin-2-1, part=Part-2
*End Instance
**
*Nset, nset=_PickedSet16, internal, instance=Part-2-1
*Nset, nset=_PickedSet16, internal, instance=Part-2-1-lin-2-1
*Elset, elset=_PickedSet16, internal, instance=Part-2-1
*Elset, elset=_PickedSet16, internal, instance=Part-2-1-lin-2-1
*Elset, elset=__PickedSurf6_S6, internal, instance=Part-1-1, generate
*Elset, elset=__PickedSurf6_S4, internal, instance=Part-1-1, generate
*Surface, type=ELEMENT, name=_PickedSurf6, internal
__PickedSurf6_S6, S6
__PickedSurf6_S4, S4
*Elset, elset=__PickedSurf25_S4, internal, instance=Part-1-1
*Surface, type=ELEMENT, name=_PickedSurf25, internal
__PickedSurf25_S4, S4
*Elset, elset=__PickedSurf29_S3, internal, instance=Part-2-1
*Elset, elset=__PickedSurf29_S6, internal, instance=Part-2-1, generate
*Elset, elset=__PickedSurf29_S4, internal, instance=Part-2-1, generate
*Surface, type=ELEMENT, name=_PickedSurf29, internal
__PickedSurf29_S3, S3
__PickedSurf29_S6, S6
__PickedSurf29_S4, S4
*Elset, elset=__PickedSurf30_S6, internal, instance=Part-1-1, generate
*Elset, elset=__PickedSurf30_S4, internal, instance=Part-1-1, generate
*Surface, type=ELEMENT, name=_PickedSurf30, internal
__PickedSurf30_S6, S6
__PickedSurf30_S4, S4
*Elset, elset=__PickedSurf31_S3, internal, instance=Part-2-1-lin-2-1
*Elset, elset=__PickedSurf31_S6, internal, instance=Part-2-1-lin-2-1, generate
*Elset, elset=__PickedSurf31_S4, internal, instance=Part-2-1-lin-2-1, generate
*Surface, type=ELEMENT, name=_PickedSurf31, internal
__PickedSurf31_S3, S3
__PickedSurf31_S6, S6
__PickedSurf31_S4, S4
*Elset, elset=__PickedSurf32_S6, internal, instance=Part-1-1, generate
*Elset, elset=__PickedSurf32_S4, internal, instance=Part-1-1, generate
*Surface, type=ELEMENT, name=_PickedSurf32, internal
__PickedSurf32_S6, S6
__PickedSurf32_S4, S4
** Constraint: Constraint-1
*Tie, name=Constraint-1, adjust=yes
_PickedSurf30, _PickedSurf29
** Constraint: Constraint-2
*Tie, name=Constraint-2, adjust=yes
_PickedSurf32, _PickedSurf31
*End Assembly
**
** MATERIALS
**
*Material, name=Concrete
*Elastic
 1e+07, 0.3
*Material, name=Material-1
*Density
1500.,
*Elastic
100000., 0.3
*Plastic
10000.,  0.
20000., 0.5
**
** INTERACTION PROPERTIES
**
*Surface Interaction, name=IntProp-1
1.,
*Friction, rough
*Surface Behavior, pressure-overclosure=HARD
** ----------------------------------------------------------------
**
** STEP: Step-1
**
*Step, name=Step-1, nlgeom=YES
*Static, direct
0.01, 1.,
**
** BOUNDARY CONDITIONS
**
** Name: BC-1 Type: Symmetry/Antisymmetry/Encastre
*Boundary
_PickedSet16, PINNED
**
** LOADS
**
** Name: Load-1   Type: Pressure
*Dsload
_PickedSurf6, PNU, 1.
** Name: Load-2   Type: Pressure
*Dsload
_PickedSurf25, PNU, 1.
**
** OUTPUT REQUESTS
**
*Restart, write, frequency=0
**
** FIELD OUTPUT: F-Output-1
**
*Output, field, variable=PRESELECT
**
** HISTORY OUTPUT: H-Output-1
**
*Output, history, variable=PRESELECT
*End Step