*Heading
** Job name: REIND Model name: Model-2
** Generated by: Abaqus/CAE 6.11-1
*Preprint, echo=NO, model=NO, history=NO, contact=NO
**
** PARTS
**
*Part, name=Part-1
*Node
*Element, type=C3D20
*Nset, nset=_PickedSet22, internal, generate
*Elset, elset=_PickedSet22, internal, generate
** Section: Section-1
*Solid Section, elset=_PickedSet22, material=Material-1
*End Part
**
*Part, name=Part-2
*Node
*Element, type=B32
*Nset, nset=_PickedSet2, internal, generate
*Elset, elset=_PickedSet2, internal, generate
*Nset, nset=_PickedSet3, internal, generate
*Elset, elset=_PickedSet3, internal, generate
** Section: Section-2  Profile: Profile-1
*Beam Section, elset=_PickedSet2, material=reinf, temperature=GRADIENTS, section=CIRC
0.5
0.,0.,-1.
*End Part
**
**
** ASSEMBLY
**
*Assembly, name=Assembly
**
**==========================================================================
**==================== The following inserted by hand=======================
**
*Elset, elset=_PickedSet1, internal, generate,instance=Part-2-1
*EMBEDDED ELEMENT, HOST ELSET=Set-1
_PickedSet1
**
**
*Elset, elset=_PickedSet2, internal, generate,instance=Part-2-1-rad-24
*EMBEDDED ELEMENT, HOST ELSET=Set-2
_PickedSet2
**
**
*Elset, elset=_PickedSet3, internal, generate,instance=Part-2-1-rad-23
*EMBEDDED ELEMENT, HOST ELSET=Set-3
_PickedSet3
**
**
*Elset, elset=_PickedSet4, internal, generate,instance=Part-2-1-rad-22
*EMBEDDED ELEMENT, HOST ELSET=Set-4
_PickedSet4
**
**
*Elset, elset=_PickedSet5, internal, generate,instance=Part-2-1-rad-21
*EMBEDDED ELEMENT, HOST ELSET=Set-5
_PickedSet5
**
**
*Elset, elset=_PickedSet6, internal, generate,instance=Part-2-1-rad-20
*EMBEDDED ELEMENT, HOST ELSET=Set-6
_PickedSet6
**
**
*Elset, elset=_PickedSet7, internal, generate,instance=Part-2-1-rad-19
*EMBEDDED ELEMENT, HOST ELSET=Set-7
_PickedSet7
**
**
*Elset, elset=_PickedSet8, internal, generate,instance=Part-2-1-rad-18
*EMBEDDED ELEMENT, HOST ELSET=Set-8
_PickedSet8
**
**
*Elset, elset=_PickedSet9, internal, generate,instance=Part-2-1-rad-17
*EMBEDDED ELEMENT, HOST ELSET=Set-9
_PickedSet9
**
**
*Elset, elset=_PickedSet10, internal, generate,instance=Part-2-1-rad-16
*EMBEDDED ELEMENT, HOST ELSET=Set-10
_PickedSet10
**
**
*Elset, elset=_PickedSet11, internal, generate,instance=Part-2-1-rad-15
*EMBEDDED ELEMENT, HOST ELSET=Set-11
_PickedSet11
**
**
*Elset, elset=_PickedSet12, internal, generate,instance=Part-2-1-rad-14
*EMBEDDED ELEMENT, HOST ELSET=Set-12
_PickedSet12
**
**
*Elset, elset=_PickedSet13, internal, generate,instance=Part-2-1-rad-13
*EMBEDDED ELEMENT, HOST ELSET=Set-13
_PickedSet13
**
**
**
*Elset, elset=_PickedSet6, internal, generate,instance=Part-2-1-rad-20
*EMBEDDED ELEMENT, HOST ELSET=Set-6
_PickedSet6
**
**
*Elset, elset=_PickedSet7, internal, generate,instance=Part-2-1-rad-19
*EMBEDDED ELEMENT, HOST ELSET=Set-7
_PickedSet7
**
**
*Elset, elset=_PickedSet8, internal, generate,instance=Part-2-1-rad-18
*EMBEDDED ELEMENT, HOST ELSET=Set-8
_PickedSet8
**
**
*Elset, elset=_PickedSet9, internal, generate,instance=Part-2-1-rad-17
*EMBEDDED ELEMENT, HOST ELSET=Set-9
_PickedSet9
**
**
*Elset, elset=_PickedSet10, internal, generate,instance=Part-2-1-rad-16
*EMBEDDED ELEMENT, HOST ELSET=Set-10
_PickedSet10
**
**
*Elset, elset=_PickedSet11, internal, generate,instance=Part-2-1-rad-15
*EMBEDDED ELEMENT, HOST ELSET=Set-11
_PickedSet11
**
**
*Elset, elset=_PickedSet12, internal, generate,instance=Part-2-1-rad-14
*EMBEDDED ELEMENT, HOST ELSET=Set-12
_PickedSet12
**
**
*Elset, elset=_PickedSet13, internal, generate,instance=Part-2-1-rad-13
*EMBEDDED ELEMENT, HOST ELSET=Set-13
_PickedSet13
**
**
**
*Elset, elset=_PickedSet14, internal, generate,instance=Part-2-1-rad-12
*EMBEDDED ELEMENT, HOST ELSET=Set-14
_PickedSet14
**
**
*Elset, elset=_PickedSet15, internal, generate,instance=Part-2-1-rad-11
*EMBEDDED ELEMENT, HOST ELSET=Set-15
_PickedSet15
**
**
*Elset, elset=_PickedSet16, internal, generate,instance=Part-2-1-rad-10
*EMBEDDED ELEMENT, HOST ELSET=Set-16
_PickedSet16
**
**
*Elset, elset=_PickedSet17, internal, generate,instance=Part-2-1-rad-9
*EMBEDDED ELEMENT, HOST ELSET=Set-17
_PickedSet17
**
**
*Elset, elset=_PickedSet18, internal, generate,instance=Part-2-1-rad-8
*EMBEDDED ELEMENT, HOST ELSET=Set-18
_PickedSet18
**
**
*Elset, elset=_PickedSet19, internal, generate,instance=Part-2-1-rad-7
*EMBEDDED ELEMENT, HOST ELSET=Set-19
_PickedSet19
**
**
*Elset, elset=_PickedSet20, internal, generate,instance=Part-2-1-rad-6
*EMBEDDED ELEMENT, HOST ELSET=Set-20
_PickedSet20
**
**
*Elset, elset=_PickedSet21, internal, generate,instance=Part-2-1-rad-5
*EMBEDDED ELEMENT, HOST ELSET=Set-21
_PickedSet21
**
**
*Elset, elset=_PickedSet22, internal, generate,instance=Part-2-1-rad-4
*EMBEDDED ELEMENT, HOST ELSET=Set-22
_PickedSet22
**
**
*Elset, elset=_PickedSet23, internal, generate,instance=Part-2-1-rad-3
*EMBEDDED ELEMENT, HOST ELSET=Set-23
_PickedSet23
**
**
*Elset, elset=_PickedSet24, internal, generate,instance=Part-2-1-rad-2
*EMBEDDED ELEMENT, HOST ELSET=Set-24
_PickedSet24
**
**======================== END OF OUTER RING OF REINFORCEMENTS=========
**=========================START OF INNER RING OF REINFORCEMENT ========
**
*Elset, elset=_PickedSet31, internal, generate,instance=Part-2-1
*EMBEDDED ELEMENT, HOST ELSET=Set-31
_PickedSet31
**
**
*Elset, elset=_PickedSet54, internal, generate,instance=Part-2-2-rad-24
*EMBEDDED ELEMENT, HOST ELSET=Set-54
_PickedSet54
**
**
*Elset, elset=_PickedSet53, internal, generate,instance=Part-2-2-rad-23
*EMBEDDED ELEMENT, HOST ELSET=Set-53
_PickedSet53
**
**
*Elset, elset=_PickedSet52, internal, generate,instance=Part-2-2-rad-22
*EMBEDDED ELEMENT, HOST ELSET=Set-52
_PickedSet52
**
**
*Elset, elset=_PickedSet51, internal, generate,instance=Part-2-2-rad-21
*EMBEDDED ELEMENT, HOST ELSET=Set-51
_PickedSet51
**
**
**
*Elset, elset=_PickedSet50, internal, generate,instance=Part-2-2-rad-20
*EMBEDDED ELEMENT, HOST ELSET=Set-50
_PickedSet50
**
**
*Elset, elset=_PickedSet49, internal, generate,instance=Part-2-2-rad-19
*EMBEDDED ELEMENT, HOST ELSET=Set-49
_PickedSet49
**
**
*Elset, elset=_PickedSet48, internal, generate,instance=Part-2-2-rad-18
*EMBEDDED ELEMENT, HOST ELSET=Set-48
_PickedSet48
**
**
*Elset, elset=_PickedSet47, internal, generate,instance=Part-2-2-rad-17
*EMBEDDED ELEMENT, HOST ELSET=Set-47
_PickedSet47
**
**
*Elset, elset=_PickedSet46, internal, generate,instance=Part-2-2-rad-16
*EMBEDDED ELEMENT, HOST ELSET=Set-46
_PickedSet46
**
**
*Elset, elset=_PickedSet45, internal, generate,instance=Part-2-2-rad-15
*EMBEDDED ELEMENT, HOST ELSET=Set-45
_PickedSet45
**
**
*Elset, elset=_PickedSet44, internal, generate,instance=Part-2-2-rad-14
*EMBEDDED ELEMENT, HOST ELSET=Set-44
_PickedSet44
**
**
*Elset, elset=_PickedSet43, internal, generate,instance=Part-2-2-rad-13
*EMBEDDED ELEMENT, HOST ELSET=Set-43
_PickedSet43
**
**
**
*Elset, elset=_PickedSet42, internal, generate,instance=Part-2-2-rad-12
*EMBEDDED ELEMENT, HOST ELSET=Set-42
_PickedSet42
**
**
*Elset, elset=_PickedSet41, internal, generate,instance=Part-2-2-rad-11
*EMBEDDED ELEMENT, HOST ELSET=Set-41
_PickedSet41
**
**
*Elset, elset=_PickedSet40, internal, generate,instance=Part-2-2-rad-10
*EMBEDDED ELEMENT, HOST ELSET=Set-40
_PickedSet40
**
**
*Elset, elset=_PickedSet39, internal, generate,instance=Part-2-2-rad-9
*EMBEDDED ELEMENT, HOST ELSET=Set-39
_PickedSet39
**
**
*Elset, elset=_PickedSet38, internal, generate,instance=Part-2-2-rad-8
*EMBEDDED ELEMENT, HOST ELSET=Set-38
_PickedSet38
**
**
*Elset, elset=_PickedSet37, internal, generate,instance=Part-2-2-rad-7
*EMBEDDED ELEMENT, HOST ELSET=Set-37
_PickedSet37
**
**
*Elset, elset=_PickedSet36, internal, generate,instance=Part-2-2-rad-6
*EMBEDDED ELEMENT, HOST ELSET=Set-36
_PickedSet36
**
**
*Elset, elset=_PickedSet35, internal, generate,instance=Part-2-2-rad-5
*EMBEDDED ELEMENT, HOST ELSET=Set-35
_PickedSet35
**
**
*Elset, elset=_PickedSet34, internal, generate,instance=Part-2-2-rad-4
*EMBEDDED ELEMENT, HOST ELSET=Set-34
_PickedSet34
**
**
*Elset, elset=_PickedSet33, internal, generate,instance=Part-2-2-rad-3
*EMBEDDED ELEMENT, HOST ELSET=Set-33
_PickedSet33
**
**
*Elset, elset=_PickedSet32, internal, generate,instance=Part-2-2-rad-2
*EMBEDDED ELEMENT, HOST ELSET=Set-32
_PickedSet32
**
**
**
*Elset, elset=_PickedSet31, internal, generate,instance=Part-2-2
*EMBEDDED ELEMENT, HOST ELSET=Set-31
_PickedSet31
**
**
**=========================END OF INSERTS =====================================
**
*Instance, name=Part-1-1, part=Part-1
*End Instance
**
*Instance, name=Part-2-1, part=Part-2
*End Instance
**
*Instance, name=Part-2-1-rad-2, part=Part-2
*End Instance
**
*Instance, name=Part-2-1-rad-3, part=Part-2
*End Instance
**
*Instance, name=Part-2-1-rad-4, part=Part-2
*End Instance
**
*Instance, name=Part-2-1-rad-5, part=Part-2
*End Instance
**
*Instance, name=Part-2-1-rad-6, part=Part-2
*End Instance
**
*Instance, name=Part-2-1-rad-7, part=Part-2
*End Instance
**
*Instance, name=Part-2-1-rad-8, part=Part-2
*End Instance
**
*Instance, name=Part-2-1-rad-9, part=Part-2
*End Instance
**
*Instance, name=Part-2-1-rad-10, part=Part-2
*End Instance
**
*Instance, name=Part-2-1-rad-11, part=Part-2
*End Instance
**
*Instance, name=Part-2-1-rad-12, part=Part-2
*End Instance
**
*Instance, name=Part-2-1-rad-13, part=Part-2
*End Instance
**
*Instance, name=Part-2-1-rad-14, part=Part-2
*End Instance
**
*Instance, name=Part-2-1-rad-15, part=Part-2
*End Instance
**
*Instance, name=Part-2-1-rad-16, part=Part-2
*End Instance
**
*Instance, name=Part-2-1-rad-17, part=Part-2
*End Instance
**
*Instance, name=Part-2-1-rad-18, part=Part-2
*End Instance
**
*Instance, name=Part-2-1-rad-19, part=Part-2
*End Instance
**
*Instance, name=Part-2-1-rad-20, part=Part-2
*End Instance
**
*Instance, name=Part-2-1-rad-21, part=Part-2
*End Instance
**
*Instance, name=Part-2-1-rad-22, part=Part-2
*End Instance
**
*Instance, name=Part-2-1-rad-23, part=Part-2
*End Instance
**
*Instance, name=Part-2-1-rad-24, part=Part-2
*End Instance
**
*Instance, name=Part-2-2, part=Part-2
*End Instance
**
*Instance, name=Part-2-2-rad-2, part=Part-2
*End Instance
**
*Instance, name=Part-2-2-rad-3, part=Part-2
*End Instance
**
*Instance, name=Part-2-2-rad-4, part=Part-2
*End Instance
**
*Instance, name=Part-2-2-rad-5, part=Part-2
*End Instance
**
*Instance, name=Part-2-2-rad-6, part=Part-2
*End Instance
**
*Instance, name=Part-2-2-rad-7, part=Part-2
*End Instance
**
*Instance, name=Part-2-2-rad-8, part=Part-2
*End Instance
**
*Instance, name=Part-2-2-rad-9, part=Part-2
*End Instance
**
*Instance, name=Part-2-2-rad-10, part=Part-2
*End Instance
**
*Instance, name=Part-2-2-rad-11, part=Part-2
*End Instance
**
*Instance, name=Part-2-2-rad-12, part=Part-2
*End Instance
**
*Instance, name=Part-2-2-rad-13, part=Part-2
*End Instance
**
*Instance, name=Part-2-2-rad-14, part=Part-2
*End Instance
**
*Instance, name=Part-2-2-rad-15, part=Part-2
*End Instance
**
*Instance, name=Part-2-2-rad-16, part=Part-2
*End Instance
**
*Instance, name=Part-2-2-rad-17, part=Part-2
*End Instance
**
*Instance, name=Part-2-2-rad-18, part=Part-2
*End Instance
**
*Instance, name=Part-2-2-rad-19, part=Part-2
*End Instance
**
*Instance, name=Part-2-2-rad-20, part=Part-2
*End Instance
**
*Instance, name=Part-2-2-rad-21, part=Part-2
*End Instance
**
*Instance, name=Part-2-2-rad-22, part=Part-2
*End Instance
**
*Instance, name=Part-2-2-rad-23, part=Part-2
*End Instance
**
*Instance, name=Part-2-2-rad-24, part=Part-2
*End Instance
**
*Nset, nset=_PickedSet78, internal, instance=Part-1-1
*Elset, elset=_PickedSet78, internal, instance=Part-1-1
*Elset, elset=Set-1, instance=Part-1-1, generate
*Elset, elset=Set-2, instance=Part-1-1, generate
*Elset, elset=Set-3, instance=Part-1-1, generate
*Elset, elset=Set-4, instance=Part-1-1, generate
*Elset, elset=Set-5, instance=Part-1-1, generate
*Elset, elset=Set-6, instance=Part-1-1, generate
*Elset, elset=Set-7, instance=Part-1-1, generate
*Elset, elset=Set-8, instance=Part-1-1, generate
*Elset, elset=Set-9, instance=Part-1-1, generate
*Elset, elset=Set-10, instance=Part-1-1, generate
*Elset, elset=Set-11, instance=Part-1-1, generate
*Elset, elset=Set-12, instance=Part-1-1, generate
*Elset, elset=Set-13, instance=Part-1-1, generate
*Elset, elset=Set-14, instance=Part-1-1, generate
*Elset, elset=Set-15, instance=Part-1-1, generate
*Elset, elset=Set-16, instance=Part-1-1, generate
*Elset, elset=Set-17, instance=Part-1-1, generate
*Elset, elset=Set-18, instance=Part-1-1, generate
*Elset, elset=Set-19, instance=Part-1-1, generate
*Elset, elset=Set-20, instance=Part-1-1, generate
** ... 28 like lines cut
**
**
**
*Elset, elset=__PickedSurf77_S1, internal, instance=Part-1-1
*Elset, elset=__PickedSurf77_S5, internal, instance=Part-1-1
*Elset, elset=__PickedSurf77_S4, internal, instance=Part-1-1
*Elset, elset=__PickedSurf77_S6, internal, instance=Part-1-1, generate
*Elset, elset=__PickedSurf77_S2, internal, instance=Part-1-1, generate
*Surface, type=ELEMENT, name=_PickedSurf77, internal
__PickedSurf77_S1, S1
__PickedSurf77_S5, S5
__PickedSurf77_S4, S4
__PickedSurf77_S6, S6
__PickedSurf77_S2, S2
*End Assembly
**
** MATERIALS
**
*Material, name=Material-1
*Elastic
 1e+15, 0.3
*CONCRETE
**
*FAILURE RATIOS
**
**
*TENSION STIFFENING
**
*Material, name=reinf
*Elastic
 1e+20, 0.3
** ----------------------------------------------------------------
**
** STEP: Step-1
**
*Step, name=Step-1
*Static
0.1, 1., 1e-05, 0.1
**
** BOUNDARY CONDITIONS
**
** Name: BC-1 Type: Symmetry/Antisymmetry/Encastre
*Boundary
_PickedSet78, PINNED
**
** LOADS
**
** Name: Load-1   Type: Pressure
*Dsload
_PickedSurf77, P, 100.
**
** OUTPUT REQUESTS
**
*Restart, write, frequency=0
**
** FIELD OUTPUT: F-Output-1
**
*Output, field, variable=PRESELECT
**
** HISTORY OUTPUT: H-Output-1
**
*Output, history, variable=PRESELECT
*End Step