*Heading
** Job name: tx-com-dil Model name: Model-1
*Preprint, echo=NO, model=NO, history=NO, contact=NO
**
** PARTS
**
*Part, name=soil-3d
*Node
*Element, type=C3D8R
*Nset, nset=_PickedSet2, internal, generate
*Elset, elset=_PickedSet2, internal
** Section: soil
*Solid Section, elset=_PickedSet2, material=nor-sand
1.,
*End Part
**
**
** ASSEMBLY
**
*Assembly, name=Assembly
**
*Instance, name=soil-3d-1, part=soil-3d
*End Instance
**
*Nset, nset=all, instance=soil-3d-1, generate
*Elset, elset=all, instance=soil-3d-1
*Nset, nset=s1, instance=soil-3d-1
*Elset, elset=s1, instance=soil-3d-1
*Nset, nset=s2, instance=soil-3d-1
*Elset, elset=s2, instance=soil-3d-1
*Nset, nset=s3, instance=soil-3d-1
*Elset, elset=s3, instance=soil-3d-1
*Nset, nset=s4, instance=soil-3d-1
*Elset, elset=s4, instance=soil-3d-1
*Nset, nset=s5, instance=soil-3d-1, generate
*Elset, elset=s5, instance=soil-3d-1
*Nset, nset=s6, instance=soil-3d-1
*Elset, elset=s6, instance=soil-3d-1
*Elset, elset=_surface-1_S2, internal, instance=soil-3d-1
*Surface, type=ELEMENT, name=surface-1
_surface-1_S2, S2
*Elset, elset=_surface-2_S6, internal, instance=soil-3d-1
*Surface, type=ELEMENT, name=surface-2
_surface-2_S6, S6
*Elset, elset=_surface-3_S3, internal, instance=soil-3d-1
*Surface, type=ELEMENT, name=surface-3
_surface-3_S3, S3
*End Assembly
**
** MATERIALS
**
*Material, name=nor-sand
*ELASTIC
   1.E5, 0.3
*Density
 1.64,
** BOUNDARY CONDITIONS
**
** Name: S2-3,8 Type: Displacement/Rotation
*Boundary
S3, 1, 1
** Name: S4-3 Type: Displacement/Rotation
*Boundary
S4, 3, 3
** Name: S5-1 Type: Displacement/Rotation
*Boundary
S5, 1, 1
** Name: S6-2 Type: Displacement/Rotation
*Boundary
S6, 2, 2
S1, 2, 2
*INITIAL CONDITIONS, TYPE=SOLUTION,USER
*INITIAL CONDITIONS, TYPE=STRESS, GEOSTATIC
all, -16.4, 0.0, 0.0, 1.0, 1, 1
** ----------------------------------------------------------------
**
** STEP: Step-1
**
*Step, name=Step-1
*dynamic, explicit
, 0.01
**
** BOUNDARY CONDITIONS
**
*DLOAD
all, GRAV, 10, 0, 0., -1.0
S1, P6NU
S3, P2NU
** Name: S2-3,8 Type: Displacement/Rotation
*Boundary, op=NEW
S2, 3, 3, -0.4
** Name: S4-3 Type: Displacement/Rotation
*Boundary, op=NEW
S4, 3, 3
** Name: S5-1 Type: Displacement/Rotation
*Boundary, op=NEW
S5, 1, 1
** Name: S6-2 Type: Displacement/Rotation
*Boundary, op=NEW
S6, 2, 2
**
** OUTPUT REQUESTS
**
**Restart, write, time interval=10
**
** FIELD OUTPUT: F-Output-1
**
*Output, field, variable=PRESELECT
**Element Output, elset=ALL
**SDV
**
** HISTORY OUTPUT: H-Output-1
**
*Output, history
*Node Output, nset=ALL
POR, U1, U2, U3, UR1, UR2, UR3
*Element Output, elset=ALL
E11, E22, E33, LE11, LE22, LE33, MISES, PRESS, S11, S22, S33, SAT, VOIDR, SDV
**El Print, freq=0
**el print,position=nodes
**Node Print, freq=0
*End Step